BDBM119704 US8685992, 28
SMILES COc1ccc(cc1)-c1cc(-c2ccsc2)c([nH]1)C(=O)NCc1ccc(cc1)C(=O)NO
InChI Key InChIKey=RZUFVMUYNQBONC-UHFFFAOYSA-N
Data  11 IC50
  Tab Delimited (TSV)   2D SDfile   Computed 3D by Vconf -m prep SDfile
Find this compound or compounds like it in BindingDB:
Activity Spreadsheet -- Enzyme Inhibition Constant Data from BindingDB
Found 1 hit for monomerid = 119704
TargetHistone deacetylase 2(Homo sapiens (Human))
Universidad Del PaíS Vasco
US Patent
LigandPNGBDBM119704(US8685992, 28)
Affinity DataIC50:  392nMT: 2°C. Assay description: The reactions were carried out in a 96-well microplate for fluorometry in a 50 μl reaction volume. After the deacetylation reaction, Fluor-de-Ly...
In DepthDetails US Patent